BDBM112821 US8629167, 32
SMILES C[C@@H](O)C(Nc1ccc([N+]#[C-])c(Cl)c1C)c1nnc(o1)-c1ccc(Cl)c(Cl)c1
InChI Key InChIKey=OUQVCOALEJPKPV-YQDUUYOCSA-N
Data  1 IC50
  Tab Delimited (TSV)   2D SDfile   Computed 3D by Vconf -m prep SDfile
Find this compound or compounds like it in BindingDB:
Activity Spreadsheet -- Enzyme Inhibition Constant Data from BindingDB
Found 1 hit for monomerid = 112821
TargetAndrogen receptor(Rattus norvegicus (Rat))
Radius Health
US Patent
LigandPNGBDBM112821(US8629167, 32)
Affinity DataIC50:  2nM. Assay description: In order to demonstrate the utility of the compounds of this invention, an androgen receptor binding assay was performed wherein many of the compound...
In DepthDetails US Patent