BDBM112826 US8629167, 37
SMILES C[C@H](O)[C@@H](Nc1ccc([N+]#[C-])c(Cl)c1C)c1nnc(o1)-c1ccc(O)c(Cl)c1
InChI Key InChIKey=BUNWWLRTVBEPHT-DYZYQPBXSA-N
Data  1 IC50
  Tab Delimited (TSV)   2D SDfile   Computed 3D by Vconf -m prep SDfile
Find this compound or compounds like it in BindingDB:
Activity Spreadsheet -- Enzyme Inhibition Constant Data from BindingDB
Found 1 hit for monomerid = 112826
TargetAndrogen receptor(Rattus norvegicus (Rat))
Radius Health
US Patent
LigandPNGBDBM112826(US8629167, 37)
Affinity DataIC50:  0.200nM. Assay description: In order to demonstrate the utility of the compounds of this invention, an androgen receptor binding assay was performed wherein many of the compound...
In DepthDetails US Patent