BDBM11333 Hydroxamate 14::N-hydroxy-2-[(2,3,4,5,6-pentafluorobenzene)sulfonamido]propanamide
SMILES CC(NS(=O)(=O)c1c(F)c(F)c(F)c(F)c1F)C(=O)NO
InChI Key InChIKey=AUIKJLRMPLDORG-UHFFFAOYSA-N
Data  10 KI  1 IC50
  Tab Delimited (TSV)   2D SDfile   Computed 3D by Vconf -m prep SDfile
Find this compound or compounds like it in BindingDB:
Activity Spreadsheet -- Enzyme Inhibition Constant Data from BindingDB
Found 11 hits for monomerid = 11333
TargetCarbonic anhydrase 1(Homo sapiens (Human))
Universita Degli Studi
LigandPNGBDBM11333(Hydroxamate 14 | N-hydroxy-2-[(2,3,4,5,6-pentafluo...)
Affinity DataKi:  7nM ΔG°:  -11.1kcal/molepH: 7.4 T: 2°C. Assay description: Initial rates of 4-nitrophenyl acetate hydrolysis catalyzed by different CA isozymes were monitored spectrophotometrically at 400 nm. A molar absorpt...
In DepthDetails ArticlePubMed
TargetCarbonic anhydrase 2(Homo sapiens (Human))
Universita Degli Studi
LigandPNGBDBM11333(Hydroxamate 14 | N-hydroxy-2-[(2,3,4,5,6-pentafluo...)
Affinity DataKi:  8nM. Assay description: Initial rates of 4-nitrophenyl acetate hydrolysis catalyzed by different CA isozymes were monitored spectrophotometrically at 400 nm. A molar absorpt...
In DepthDetails ArticlePubMed
TargetCarbonic anhydrase 4(Bos taurus (bovine))
Universita Degli Studi
LigandPNGBDBM11333(Hydroxamate 14 | N-hydroxy-2-[(2,3,4,5,6-pentafluo...)
Affinity DataKi:  10nM. Assay description: Initial rates of 4-nitrophenyl acetate hydrolysis catalyzed by different CA isozymes were monitored spectrophotometrically at 400 nm. A molar absorpt...
In DepthDetails ArticlePubMed
Target72 kDa type IV collagenase(Homo sapiens (Human))
Universita Degli Studi
LigandPNGBDBM11333(Hydroxamate 14 | N-hydroxy-2-[(2,3,4,5,6-pentafluo...)
Affinity DataKi:  40nM. Assay description: Initial rates for the hydrolysis of the thioester substrate AcProLeuGly-S-LeuLeuGlyOEt, coupled to the reaction with 5,5-dithiobis(2-nitrobenzoic aci...
In DepthDetails ArticlePubMed
Target72 kDa type IV collagenase(Homo sapiens (Human))
Universita Degli Studi
LigandPNGBDBM11333(Hydroxamate 14 | N-hydroxy-2-[(2,3,4,5,6-pentafluo...)
Affinity DataKi:  40nM. Assay description: Inhibition of MMP2
In DepthDetails ArticlePubMed
TargetCollagenase ColG(Clostridium histolyticum)
Universita Degli Studi
LigandPNGBDBM11333(Hydroxamate 14 | N-hydroxy-2-[(2,3,4,5,6-pentafluo...)
Affinity DataKi:  45nM. Assay description: The rate of hydrolysis was determined from the change in absorbance at 324 nm using an extinction coefficient, 24700 M-1 cm-1 for FALGPA. Initial vel...
In DepthDetails ArticlePubMed
TargetMatrix metalloproteinase-9(Homo sapiens (Human))
Pomona College
Curated by ChEMBL
LigandPNGBDBM11333(Hydroxamate 14 | N-hydroxy-2-[(2,3,4,5,6-pentafluo...)
Affinity DataKi:  96nM. Assay description: Inhibition of MMP9
In DepthDetails ArticlePubMed
TargetMatrix metalloproteinase-9(Homo sapiens (Human))
Pomona College
Curated by ChEMBL
LigandPNGBDBM11333(Hydroxamate 14 | N-hydroxy-2-[(2,3,4,5,6-pentafluo...)
Affinity DataKi:  96nM. Assay description: Initial rates for the hydrolysis of the thioester substrate AcProLeuGly-S-LeuLeuGlyOEt, coupled to the reaction with 5,5-dithiobis(2-nitrobenzoic aci...
In DepthDetails ArticlePubMed
TargetNeutrophil collagenase(Homo sapiens (Human))
Universita Degli Studi
LigandPNGBDBM11333(Hydroxamate 14 | N-hydroxy-2-[(2,3,4,5,6-pentafluo...)
Affinity DataKi:  116nM. Assay description: Initial rates for the hydrolysis of the thioester substrate AcProLeuGly-S-LeuLeuGlyOEt, coupled to the reaction with 5,5-dithiobis(2-nitrobenzoic aci...
In DepthDetails ArticlePubMed
TargetInterstitial collagenase(Homo sapiens (Human))
Universita Degli Studi
LigandPNGBDBM11333(Hydroxamate 14 | N-hydroxy-2-[(2,3,4,5,6-pentafluo...)
Affinity DataKi:  150nM. Assay description: Initial rates for the hydrolysis of the thioester substrate AcProLeuGly-S-LeuLeuGlyOEt, coupled to the reaction with 5,5-dithiobis(2-nitrobenzoic aci...
In DepthDetails ArticlePubMed
TargetInterstitial collagenase(Homo sapiens (Human))
Universita Degli Studi
LigandPNGBDBM11333(Hydroxamate 14 | N-hydroxy-2-[(2,3,4,5,6-pentafluo...)
Affinity DataIC50:  151nM. Assay description: Inhibition of MMP1
In DepthDetails ArticlePubMed