BDBM113771 2‐(4‐chlorophenyl)‐2‐(6‐chloropyridin‐2‐ yl)acetonitrile (3)
SMILES Clc1ccc(cc1)C(C#N)c1cccc(Cl)n1
InChI Key InChIKey=KFUYTJBERFHHIL-UHFFFAOYSA-N
Data  1 IC50
PDB links: 1 PDB ID matches this monomer.
  Tab Delimited (TSV)   2D SDfile   Computed 3D by Vconf -m prep SDfile
Find this compound or compounds like it in BindingDB:
Activity Spreadsheet -- Enzyme Inhibition Constant Data from BindingDB
Found 1 hit for monomerid = 113771
TargetAcyl-homoserine lactone acylase PvdQ [A190E,F674L](Pseudomonas aeruginosa)
The Broad Institute , Cambridge, Massachusetts 02142, United States
LigandPNGBDBM113771(2‐(4‐chlorophenyl)‐2‐(6...)
Affinity DataIC50:  40nM. Assay description: The assay was performed with nine compound concentrations that ranged from 3 nM to 19.5 µM with PvdQ concentration of 20 nM. The positive contro...