BDBM113959 1-[4-(1,3-benzodioxol-5-yl)-1,3-thiazol-2-yl]-2,2,2-trifluoro-1-phenylethanol::1-[4-(1,3-benzodioxol-5-yl)-1,3-thiazol-2-yl]-2,2,2-tris(fluoranyl)-1-phenyl-ethanol::1-[4-(1,3-benzodioxol-5-yl)-2-thiazolyl]-2,2,2-trifluoro-1-phenylethanol::1-[4-(1,3-benzodioxol-5-yl)thiazol-2-yl]-2,2,2-trifluoro-1-phenyl-ethanol::MLS003122536::SMR001277448::cid_49789625
SMILES OC(c1nc(cs1)-c1ccc2OCOc2c1)(c1ccccc1)C(F)(F)F
InChI Key InChIKey=MOOWXUFMZSHWQQ-UHFFFAOYSA-N
Data  2 IC50
  Tab Delimited (TSV)   2D SDfile   Computed 3D by Vconf -m prep SDfile
Find this compound or compounds like it in BindingDB:
Activity Spreadsheet -- Enzyme Inhibition Constant Data from BindingDB
Found 2 hits for monomerid = 113959
TargetDisintegrin and metalloproteinase domain-containing protein 10(Homo sapiens (Human))
The Scripps Research Institute Molecular Screening Center
Curated by PubChem BioAssay
LigandPNGBDBM113959(1-[4-(1,3-benzodioxol-5-yl)-1,3-thiazol-2-yl]-2,2,...)
Affinity DataIC50:  7.73E+3nM. Assay description: Source (MLPCN Center Name): The Scripps Research Institute Molecular Screening Center (SRIMSC) Center Affiliation: Torrey Pines Institute for Molecul...
Ligand InfoPC cidPC sid
In DepthDetails PCBioAssay
TargetDisintegrin and metalloproteinase domain-containing protein 17(Homo sapiens (Human))
The Scripps Research Institute Molecular Screening Center
Curated by PubChem BioAssay
LigandPNGBDBM113959(1-[4-(1,3-benzodioxol-5-yl)-1,3-thiazol-2-yl]-2,2,...)
Affinity DataIC50:  6.95E+4nM. Assay description: Source (MLPCN Center Name): The Scripps Research Institute Molecular Screening Center (SRIMSC) Center Affiliation: Torrey Pines Institute for Molecul...
Ligand InfoPC cidPC sid
In DepthDetails PCBioAssay