BDBM114023 (2,5-dioxo-1-phenylpyrrolidin-3-yl) N'-[(E)-1-thiophen-2-ylethylideneamino]carbamimidothioate::2,5-dioxo-1-phenyl-3-pyrrolidinyl 2-[1-(2-thienyl)ethylidene]hydrazinecarbimidothioate::2-(2,5-diketo-1-phenyl-pyrrolidin-3-yl)-3-[(E)-1-(2-thienyl)ethylideneamino]isothiourea::MLS000579121::N'-[(E)-1-thiophen-2-ylethylideneamino]carbamimidothioic acid (2,5-dioxo-1-phenyl-3-pyrrolidinyl) ester::SMR000186710::[2,5-bis(oxidanylidene)-1-phenyl-pyrrolidin-3-yl] N'-[(E)-1-thiophen-2-ylethylideneamino]carbamimidothioate::cid_9566953
SMILES CC(=NNC(=N)Sc1cc(O)n(c1O)-c1ccccc1)c1cccs1
InChI Key InChIKey=QOWRHSBGMQKKSY-UHFFFAOYSA-N
Data  2 IC50
  Tab Delimited (TSV)   2D SDfile   Computed 3D by Vconf -m prep SDfile
Find this compound or compounds like it in BindingDB:
Activity Spreadsheet -- Enzyme Inhibition Constant Data from BindingDB
Found 2 hits for monomerid = 114023
TargetDisintegrin and metalloproteinase domain-containing protein 17(Homo sapiens (Human))
The Scripps Research Institute Molecular Screening Center
Curated by PubChem BioAssay
LigandPNGBDBM114023((2,5-dioxo-1-phenylpyrrolidin-3-yl) N'-[(E)-1-thio...)
Affinity DataIC50:  6.95E+4nM. Assay description: Source (MLPCN Center Name): The Scripps Research Institute Molecular Screening Center (SRIMSC) Center Affiliation: Torrey Pines Institute for Molecul...
In DepthDetails PCBioAssay
TargetDisintegrin and metalloproteinase domain-containing protein 10(Homo sapiens (Human))
The Scripps Research Institute Molecular Screening Center
Curated by PubChem BioAssay
LigandPNGBDBM114023((2,5-dioxo-1-phenylpyrrolidin-3-yl) N'-[(E)-1-thio...)
Affinity DataIC50:  9.96E+3nM. Assay description: Source (MLPCN Center Name): The Scripps Research Institute Molecular Screening Center (SRIMSC) Center Affiliation: Torrey Pines Institute for Molecul...
In DepthDetails PCBioAssay