BDBM114161 2-[[4-(4-chlorophenyl)-5-(phenoxymethyl)-1,2,4-triazol-3-yl]sulfanyl]-N-(2-phenylphenyl)acetamide::2-[[4-(4-chlorophenyl)-5-(phenoxymethyl)-1,2,4-triazol-3-yl]sulfanyl]-N-(2-phenylphenyl)ethanamide::2-[[4-(4-chlorophenyl)-5-(phenoxymethyl)-1,2,4-triazol-3-yl]thio]-N-(2-phenylphenyl)acetamide::MLS003127825::SMR001835887::cid_2038103
SMILES Clc1ccc(cc1)-n1c(COc2ccccc2)nnc1SCC(=O)Nc1ccccc1-c1ccccc1
InChI Key InChIKey=ZUNFEHSUKKFQNU-UHFFFAOYSA-N
Data  2 IC50
  Tab Delimited (TSV)   2D SDfile   Computed 3D by Vconf -m prep SDfile
Find this compound or compounds like it in BindingDB:
Activity Spreadsheet -- Enzyme Inhibition Constant Data from BindingDB
Found 2 hits for monomerid = 114161
TargetDisintegrin and metalloproteinase domain-containing protein 17(Homo sapiens (Human))
The Scripps Research Institute Molecular Screening Center
Curated by PubChem BioAssay
LigandPNGBDBM114161(2-[[4-(4-chlorophenyl)-5-(phenoxymethyl)-1,2,4-tri...)
Affinity DataIC50:  6.95E+4nM. Assay description: Source (MLPCN Center Name): The Scripps Research Institute Molecular Screening Center (SRIMSC) Center Affiliation: Torrey Pines Institute for Molecul...
In DepthDetails PCBioAssay
TargetDisintegrin and metalloproteinase domain-containing protein 10(Homo sapiens (Human))
The Scripps Research Institute Molecular Screening Center
Curated by PubChem BioAssay
LigandPNGBDBM114161(2-[[4-(4-chlorophenyl)-5-(phenoxymethyl)-1,2,4-tri...)
Affinity DataIC50:  6.95E+4nM. Assay description: Source (MLPCN Center Name): The Scripps Research Institute Molecular Screening Center (SRIMSC) Center Affiliation: Torrey Pines Institute for Molecul...
In DepthDetails PCBioAssay