BDBM114198 4-(3-pyridinylamino)naphthalene-1,2-dione::4-(3-pyridylamino)-1,2-naphthoquinone::4-(pyridin-3-ylamino)naphthalene-1,2-dione::MLS002701674::SMR001565273::cid_367787
SMILES O=C1C=C(Nc2cccnc2)c2ccccc2C1=O
InChI Key InChIKey=HZFXWCMVFFTFJE-UHFFFAOYSA-N
Data  1 IC50
  Tab Delimited (TSV)   2D SDfile   Computed 3D by Vconf -m prep SDfile
Find this compound or compounds like it in BindingDB:
Activity Spreadsheet -- Enzyme Inhibition Constant Data from BindingDB
Found 1 hit for monomerid = 114198
TargetTyrosyl-DNA phosphodiesterase 2(Homo sapiens (Human))
The Scripps Research Institute Molecular Screening Center
Curated by PubChem BioAssay
LigandPNGBDBM114198(4-(3-pyridinylamino)naphthalene-1,2-dione | 4-(3-p...)
Affinity DataIC50:  4.03E+3nM. Assay description: Source (MLPCN Center Name): The Scripps Research Institute Molecular Screening Center (SRIMSC) Center Affiliation: The Scripps Research Institute (TS...
In DepthDetails PCBioAssay