BDBM114235 MLS000571556::N-(4-fluorobenzyl)-4,5,6,7-tetrahydrobenzothiophene-2-carboxamide::N-[(4-fluorophenyl)methyl]-4,5,6,7-tetrahydro-1-benzothiophene-2-carboxamide::SMR000150983::cid_2570016
SMILES Fc1ccc(CNC(=O)c2cc3CCCCc3s2)cc1
InChI Key InChIKey=SAQIWNFPTKVSGJ-UHFFFAOYSA-N
Data  2 IC50
  Tab Delimited (TSV)   2D SDfile   Computed 3D by Vconf -m prep SDfile
Find this compound or compounds like it in BindingDB:
Activity Spreadsheet -- Enzyme Inhibition Constant Data from BindingDB
Found 2 hits for monomerid = 114235
Target1-phosphatidylinositol 4,5-bisphosphate phosphodiesterase beta-3(Homo sapiens (Human))
The Scripps Research Institute Molecular Screening Center
Curated by PubChem BioAssay
LigandPNGBDBM114235(MLS000571556 | N-(4-fluorobenzyl)-4,5,6,7-tetrahyd...)
Affinity DataIC50:  1.23E+5nM. Assay description: Source (MLPCN Center Name): The Scripps Research Institute Molecular Screening Center (SRIMSC) Center Affiliation: The Scripps Research Institute Ass...
In DepthDetails PCBioAssay
Target1-phosphatidylinositol 4,5-bisphosphate phosphodiesterase gamma-1 [1-999,I813T](Homo sapiens (Human))
The Scripps Research Institute Molecular Screening Center
Curated by PubChem BioAssay
LigandPNGBDBM114235(MLS000571556 | N-(4-fluorobenzyl)-4,5,6,7-tetrahyd...)
Affinity DataIC50:  1.23E+5nM. Assay description: Source (MLPCN Center Name): The Scripps Research Institute Molecular Screening Center (SRIMSC) Center Affiliation: The Scripps Research Institute Ass...
In DepthDetails PCBioAssay