BDBM114244 1-(2-methylpropyl)-3-[(5-methylthiophen-3-yl)carbonylamino]thiourea::1-(2-methylpropyl)-3-[(5-methylthiophene-3-carbonyl)amino]thiourea::1-(2-methylpropyl)-3-[[(5-methyl-3-thiophenyl)-oxomethyl]amino]thiourea::1-isobutyl-3-[(5-methylthiophene-3-carbonyl)amino]thiourea::MLS000698604::N-isobutyl-2-[(5-methyl-3-thienyl)carbonyl]hydrazinecarbothioamide::SMR000228176::cid_3354813
SMILES CC(C)CNC(=S)NNC(=O)c1csc(C)c1
InChI Key InChIKey=FXNFTLBRFLVLST-UHFFFAOYSA-N
Data  2 IC50
  Tab Delimited (TSV)   2D SDfile   Computed 3D by Vconf -m prep SDfile
Find this compound or compounds like it in BindingDB:
Activity Spreadsheet -- Enzyme Inhibition Constant Data from BindingDB
Found 2 hits for monomerid = 114244
Target1-phosphatidylinositol 4,5-bisphosphate phosphodiesterase beta-3(Homo sapiens (Human))
The Scripps Research Institute Molecular Screening Center
Curated by PubChem BioAssay
LigandPNGBDBM114244(1-(2-methylpropyl)-3-[(5-methylthiophen-3-yl)carbo...)
Affinity DataIC50:  1.22E+5nM. Assay description: Source (MLPCN Center Name): The Scripps Research Institute Molecular Screening Center (SRIMSC) Center Affiliation: The Scripps Research Institute Ass...
In DepthDetails PCBioAssay
Target1-phosphatidylinositol 4,5-bisphosphate phosphodiesterase gamma-1 [1-999,I813T](Homo sapiens (Human))
The Scripps Research Institute Molecular Screening Center
Curated by PubChem BioAssay
LigandPNGBDBM114244(1-(2-methylpropyl)-3-[(5-methylthiophen-3-yl)carbo...)
Affinity DataIC50:  1.22E+5nM. Assay description: Source (MLPCN Center Name): The Scripps Research Institute Molecular Screening Center (SRIMSC) Center Affiliation: The Scripps Research Institute Ass...
In DepthDetails PCBioAssay