BDBM114252 1-keto-3-(4-phenoxyphenyl)-1,3-thiazolidin-4-one::1-oxidanylidene-3-(4-phenoxyphenyl)-1,3-thiazolidin-4-one::1-oxo-3-(4-phenoxyphenyl)-1,3-thiazolidin-4-one::3-(4-phenoxyphenyl)-1lambda~4~,3-thiazolane-1,4-dione::MLS000694767::SMR000333091::cid_3789397
SMILES O=C1CS(=O)CN1c1ccc(Oc2ccccc2)cc1
InChI Key InChIKey=RTNXMDBFLGRUJT-UHFFFAOYSA-N
Data  2 IC50
  Tab Delimited (TSV)   2D SDfile   Computed 3D by Vconf -m prep SDfile
Find this compound or compounds like it in BindingDB:
Activity Spreadsheet -- Enzyme Inhibition Constant Data from BindingDB
Found 2 hits for monomerid = 114252
Target1-phosphatidylinositol 4,5-bisphosphate phosphodiesterase beta-3(Homo sapiens (Human))
The Scripps Research Institute Molecular Screening Center
Curated by PubChem BioAssay
LigandPNGBDBM114252(1-keto-3-(4-phenoxyphenyl)-1,3-thiazolidin-4-one |...)
Affinity DataIC50:  1.22E+5nM. Assay description: Source (MLPCN Center Name): The Scripps Research Institute Molecular Screening Center (SRIMSC) Center Affiliation: The Scripps Research Institute Ass...
In DepthDetails PCBioAssay
Target1-phosphatidylinositol 4,5-bisphosphate phosphodiesterase gamma-1 [1-999,I813T](Homo sapiens (Human))
The Scripps Research Institute Molecular Screening Center
Curated by PubChem BioAssay
LigandPNGBDBM114252(1-keto-3-(4-phenoxyphenyl)-1,3-thiazolidin-4-one |...)
Affinity DataIC50:  1.25E+4nM. Assay description: Source (MLPCN Center Name): The Scripps Research Institute Molecular Screening Center (SRIMSC) Center Affiliation: The Scripps Research Institute Ass...
In DepthDetails PCBioAssay