BDBM114292 2-(2-cyano-3-pyridinyl)-2-methylpropanoic acid methyl ester::2-(2-cyano-3-pyridyl)-2-methyl-propionic acid methyl ester::MLS002839129::SMR001788724::cid_45479905::methyl 2-(2-cyanopyridin-3-yl)-2-methyl-propanoate::methyl 2-(2-cyanopyridin-3-yl)-2-methylpropanoate
SMILES COC(=O)C(C)(C)c1cccnc1C#N
InChI Key InChIKey=VJTOAUNPHPPTJZ-UHFFFAOYSA-N
Data  2 IC50
  Tab Delimited (TSV)   2D SDfile   Computed 3D by Vconf -m prep SDfile
Find this compound or compounds like it in BindingDB:
Activity Spreadsheet -- Enzyme Inhibition Constant Data from BindingDB
Found 2 hits for monomerid = 114292
Target1-phosphatidylinositol 4,5-bisphosphate phosphodiesterase gamma-1 [1-999,I813T](Homo sapiens (Human))
The Scripps Research Institute Molecular Screening Center
Curated by PubChem BioAssay
LigandPNGBDBM114292(2-(2-cyano-3-pyridinyl)-2-methylpropanoic acid met...)
Affinity DataIC50:  2.70E+3nM. Assay description: Source (MLPCN Center Name): The Scripps Research Institute Molecular Screening Center (SRIMSC) Center Affiliation: The Scripps Research Institute Ass...
Ligand InfoPC cidPC sid
In DepthDetails PCBioAssay
Target1-phosphatidylinositol 4,5-bisphosphate phosphodiesterase beta-3(Homo sapiens (Human))
The Scripps Research Institute Molecular Screening Center
Curated by PubChem BioAssay
LigandPNGBDBM114292(2-(2-cyano-3-pyridinyl)-2-methylpropanoic acid met...)
Affinity DataIC50:  1.22E+5nM. Assay description: Source (MLPCN Center Name): The Scripps Research Institute Molecular Screening Center (SRIMSC) Center Affiliation: The Scripps Research Institute Ass...
Ligand InfoPC cidPC sid
In DepthDetails PCBioAssay