BDBM114331 2-(2-Ethyl-quinazolin-4-ylsulfanyl)-1-phenothiazin-10-yl-ethanone::2-(2-ethylquinazolin-4-yl)sulfanyl-1-phenothiazin-10-yl-ethanone::2-(2-ethylquinazolin-4-yl)sulfanyl-1-phenothiazin-10-ylethanone::2-[(2-ethyl-4-quinazolinyl)thio]-1-(10-phenothiazinyl)ethanone::2-[(2-ethylquinazolin-4-yl)thio]-1-phenothiazin-10-yl-ethanone::MLS000555763::SMR000172945::cid_1435033
SMILES CCc1nc(SCC(=O)N2c3ccccc3Sc3ccccc23)c2ccccc2n1
InChI Key InChIKey=HMROKRSPIQUEHJ-UHFFFAOYSA-N
Data  1 IC50
  Tab Delimited (TSV)   2D SDfile   Computed 3D by Vconf -m prep SDfile
Find this compound or compounds like it in BindingDB:
Activity Spreadsheet -- Enzyme Inhibition Constant Data from BindingDB
Found 1 hit for monomerid = 114331
TargetMajor prion protein(Homo sapiens (Human))
The Scripps Research Institute Molecular Screening Center
Curated by PubChem BioAssay
LigandPNGBDBM114331(2-(2-Ethyl-quinazolin-4-ylsulfanyl)-1-phenothiazin...)
Affinity DataIC50:  1.84E+3nM. Assay description: Source (MLPCN Center Name): The Scripps Research Institute Molecular Screening Center (SRIMSC) Affiliation: The Scripps Research Institute, TSRI Assa...
In DepthDetails PCBioAssay