BDBM114392 2-(5,6-dimethylthieno[2,3-d]pyrimidin-4-yl)sulfanylbenzoic acid::2-[(5,6-dimethyl-4-thieno[2,3-d]pyrimidinyl)thio]benzoic acid::2-[(5,6-dimethylthieno[2,3-d]pyrimidin-4-yl)thio]benzoic acid::MLS000773492::SMR000364244::cid_2384232
SMILES Cc1sc2ncnc(Sc3ccccc3C(O)=O)c2c1C
InChI Key InChIKey=TZPXEPYUAQIFRO-UHFFFAOYSA-N
Data  1 IC50
  Tab Delimited (TSV)   2D SDfile   Computed 3D by Vconf -m prep SDfile
Find this compound or compounds like it in BindingDB:
Activity Spreadsheet -- Enzyme Inhibition Constant Data from BindingDB
Found 1 hit for monomerid = 114392
TargetMajor prion protein(Homo sapiens (Human))
The Scripps Research Institute Molecular Screening Center
Curated by PubChem BioAssay
LigandPNGBDBM114392(2-(5,6-dimethylthieno[2,3-d]pyrimidin-4-yl)sulfany...)
Affinity DataIC50:  908nM. Assay description: Source (MLPCN Center Name): The Scripps Research Institute Molecular Screening Center (SRIMSC) Affiliation: The Scripps Research Institute, TSRI Assa...
In DepthDetails PCBioAssay