BDBM114613 1-[(5-bromanylthiophen-2-yl)methyl]-4-pyridin-2-yl-piperazine::1-[(5-bromo-2-thienyl)methyl]-4-(2-pyridyl)piperazine::1-[(5-bromo-2-thiophenyl)methyl]-4-(2-pyridinyl)piperazine::1-[(5-bromothiophen-2-yl)methyl]-4-pyridin-2-ylpiperazine::SR-01000202086::SR-01000202086-3::cid_2838302
SMILES Brc1ccc(CN2CCN(CC2)c2ccccn2)s1
InChI Key InChIKey=YBLRRRKATMWSKQ-UHFFFAOYSA-N
Data  2 EC50
  Tab Delimited (TSV)   2D SDfile   Computed 3D by Vconf -m prep SDfile
Find this compound or compounds like it in BindingDB:
Activity Spreadsheet -- Enzyme Inhibition Constant Data from BindingDB
Found 2 hits for monomerid = 114613
Target5-hydroxytryptamine receptor 2A(Mus musculus (Mouse))
The Scripps Research Institute Molecular Screening Center
Curated by PubChem BioAssay
LigandPNGBDBM114613(1-[(5-bromanylthiophen-2-yl)methyl]-4-pyridin-2-yl...)
Affinity DataEC50:  7.61E+4nM. Assay description: Source (MLPCN Center Name): The Scripps Research Institute Molecular Screening Center (SRIMSC) Affiliation: The Scripps Research Institute, TSRI Assa...
In DepthDetails PCBioAssay
TargetMu-type opioid receptor(Homo sapiens (Human))
The Scripps Research Institute Molecular Screening Center
Curated by PubChem BioAssay
LigandPNGBDBM114613(1-[(5-bromanylthiophen-2-yl)methyl]-4-pyridin-2-yl...)
Affinity DataEC50:  9.25E+4nM. Assay description: Source (MLPCN Center Name): The Scripps Research Institute Molecular Screening Center (SRIMSC) Assay Provider: Laura Bohn External Assay ID: OPRM1_AC...
In DepthDetails PCBioAssay