BDBM114660 MLS000394762::N-[4-(1H-benzimidazol-2-yl)phenyl]-2-chloranyl-5-[methyl(phenyl)sulfamoyl]benzamide::N-[4-(1H-benzimidazol-2-yl)phenyl]-2-chloro-5-[methyl(phenyl)sulfamoyl]benzamide::SMR000242887::cid_2336107
SMILES CN(c1ccccc1)S(=O)(=O)c1ccc(Cl)c(c1)C(=O)Nc1ccc(cc1)-c1nc2ccccc2[nH]1
InChI Key InChIKey=HIVWZGAUBWTWOS-UHFFFAOYSA-N
Data  2 IC50
  Tab Delimited (TSV)   2D SDfile   Computed 3D by Vconf -m prep SDfile
Find this compound or compounds like it in BindingDB:
Activity Spreadsheet -- Enzyme Inhibition Constant Data from BindingDB
Found 2 hits for monomerid = 114660
TargetFibrinogen beta chain [164-491](Homo sapiens (Human))
The Scripps Research Institute Molecular Screening Center
Curated by PubChem BioAssay
LigandPNGBDBM114660(MLS000394762 | N-[4-(1H-benzimidazol-2-yl)phenyl]-...)
Affinity DataIC50:  8.33E+4nM. Assay description: Source (MLPCN Center Name): The Scripps Research Institute Molecular Screening Center (SRIMSC) Center Affiliation: Harvard Medical School/Massachuset...
In DepthDetails PCBioAssay
TargetFibrinogen beta chain [164-491](Homo sapiens (Human))
The Scripps Research Institute Molecular Screening Center
Curated by PubChem BioAssay
LigandPNGBDBM114660(MLS000394762 | N-[4-(1H-benzimidazol-2-yl)phenyl]-...)
Affinity DataIC50:  8.33E+4nM. Assay description: Source (MLPCN Center Name): The Scripps Research Institute Molecular Screening Center (SRIMSC) Center Affiliation: Harvard Medical School/Massachuset...
In DepthDetails PCBioAssay