BDBM114863 MLS000334398::N-[3-[4-bromo-3-(trifluoromethyl)anilino]-3-keto-propyl]-2-chloro-benzamide::N-[3-[4-bromo-3-(trifluoromethyl)anilino]-3-oxopropyl]-2-chlorobenzamide::N-[3-[[4-bromanyl-3-(trifluoromethyl)phenyl]amino]-3-oxidanylidene-propyl]-2-chloranyl-benzamide::SMR000249156::cid_2481997
SMILES FC(F)(F)c1cc(NC(=O)CCNC(=O)c2ccccc2Cl)ccc1Br
InChI Key InChIKey=SCFUXYGOTDGMAV-UHFFFAOYSA-N
Data  2 IC50
  Tab Delimited (TSV)   2D SDfile   Computed 3D by Vconf -m prep SDfile
Find this compound or compounds like it in BindingDB:
Activity Spreadsheet -- Enzyme Inhibition Constant Data from BindingDB
Found 2 hits for monomerid = 114863
TargetNuclear hormone receptor family member daf-12(Caenorhabditis elegans)
The Scripps Research Institute Molecular Screening Center
Curated by PubChem BioAssay
LigandPNGBDBM114863(MLS000334398 | N-[3-[4-bromo-3-(trifluoromethyl)an...)
Affinity DataIC50:  6.75E+4nM. Assay description: Source (MLPCN Center Name): The Scripps Research Institute Molecular Screening Center Affiliation: UT Southwestern Assay Provider: David Mangelsdorf,...
In DepthDetails PCBioAssay
TargetOxysterols receptor LXR-beta(Homo sapiens (Human))
The Scripps Research Institute Molecular Screening Center
Curated by PubChem BioAssay
LigandPNGBDBM114863(MLS000334398 | N-[3-[4-bromo-3-(trifluoromethyl)an...)
Affinity DataIC50:  6.75E+4nM. Assay description: Source (MLPCN Center Name): The Scripps Research Institute Molecular Screening Center Affiliation: UT Southwestern Assay Provider: David Mangelsdorf,...
In DepthDetails PCBioAssay