BDBM115104 4-[[6-[3-(dimethylamino)phenyl]-4-pyrimidinyl]amino]-3-methylphenol::4-[[6-[3-(dimethylamino)phenyl]pyrimidin-4-yl]amino]-3-methyl-phenol::4-[[6-[3-(dimethylamino)phenyl]pyrimidin-4-yl]amino]-3-methylphenol::MLS003123197::SMR001454153::cid_49790647
SMILES CN(C)c1cccc(c1)-c1cc(Nc2ccc(O)cc2C)ncn1
InChI Key InChIKey=WMJMKQUQNODCMX-UHFFFAOYSA-N
Data  1 EC50
  Tab Delimited (TSV)   2D SDfile   Computed 3D by Vconf -m prep SDfile
Find this compound or compounds like it in BindingDB:
Activity Spreadsheet -- Enzyme Inhibition Constant Data from BindingDB
Found 1 hit for monomerid = 115104
TargetOxysterols receptor LXR-beta(Homo sapiens (Human))
The Scripps Research Institute Molecular Screening Center
Curated by PubChem BioAssay
LigandPNGBDBM115104(4-[[6-[3-(dimethylamino)phenyl]-4-pyrimidinyl]amin...)
Affinity DataEC50:  6.75E+4nM. Assay description: Source (MLPCN Center Name): The Scripps Research Institute Molecular Screening Center Affiliation: UT Southwestern Assay Provider: David Mangelsdorf,...
Ligand InfoPC cidPC sid
In DepthDetails PCBioAssay