BDBM118338 US8653111, 62
SMILES CC(C)(C)OC(=O)c1ccc(nc1)-n1[nH]cc(-n2ccnn2)c1=O
InChI Key InChIKey=HWQQDVNGHZIALS-UHFFFAOYSA-N
Data  5 IC50
  Tab Delimited (TSV)   2D SDfile   Computed 3D by Vconf -m prep SDfile
Find this compound or compounds like it in BindingDB:
Activity Spreadsheet -- Enzyme Inhibition Constant Data from BindingDB
Found 5 hits for monomerid = 118338
TargetProlyl hydroxylase EGLN2(Homo sapiens (Human))
Bayer Intellectual Property
US Patent
LigandPNGBDBM118338(US8653111, 62)
Affinity DataIC50:  50nM. Assay description: Hydroxylated HIF bonds specifically to the von Hippel-Lindau protein-elongin B-elongin C complex (VBC complex). This interaction occurs only if HIF i...
In DepthDetails US Patent
TargetEgl nine homolog 1(Homo sapiens (Human))
University Of Oxford
Curated by ChEMBL
LigandPNGBDBM118338(US8653111, 62)
Affinity DataIC50:  3nM. Assay description: Inhibition of recombinant human PHD2 using 2OG as substrate and Fe2 as co-factor assessed as hydroxylation incubated for 15 mins in presence of L-asc...
In DepthDetails ArticlePubMed
TargetProlyl 4-hydroxylase(Paramecium bursaria Chlorella virus 1)
University Of Oxford
Curated by ChEMBL
LigandPNGBDBM118338(US8653111, 62)
Affinity DataIC50:  2.50E+3nM. Assay description: Inhibition of N-terminal His6-tagged recombinant Paramecium bursaria chlorella virus 1 CPH expressed in Escherichia coli Rosetta 2 (DE3) cells pre-in...
In DepthDetails ArticlePubMed
TargetHypoxia-inducible factor 1-alpha inhibitor(Homo sapiens (Human))
University Of Oxford
Curated by ChEMBL
LigandPNGBDBM118338(US8653111, 62)
Affinity DataIC50:  6.60E+4nM. Assay description: Inhibition of recombinant human FIH using 2OG as substrate and Fe2 as co-factor assessed as hydroxylation incubated for 15 mins in presence of L-asco...
In DepthDetails ArticlePubMed
TargetProlyl 3-hydroxylase OGFOD1(Homo sapiens)
University Of Oxford
Curated by ChEMBL
LigandPNGBDBM118338(US8653111, 62)
Affinity DataIC50:  5.10E+3nM. Assay description: Inhibition of recombinant human OGFOD1 using 2OG as substrate and Fe2 as co-factor assessed as hydroxylation incubated for 15 mins in presence of L-a...
In DepthDetails ArticlePubMed