BDBM119679 US8680119, 68
SMILES COc1cccc(c1)C(=O)Nc1ccc(OCCO)c(c1)-c1c(Cl)cnn1C
InChI Key InChIKey=YNPPKWRFHGJIMF-UHFFFAOYSA-N
Data  1 IC50
  Tab Delimited (TSV)   2D SDfile   Computed 3D by Vconf -m prep SDfile
Find this compound or compounds like it in BindingDB:
Activity Spreadsheet -- Enzyme Inhibition Constant Data from BindingDB
Found 1 hit for monomerid = 119679
Target5-hydroxytryptamine receptor 2A(Homo sapiens (Human))
Arena Pharmaceuticals
US Patent
LigandPNGBDBM119679(US8680119, 68)
Affinity DataIC50:  0.510nMpH: 7.4Assay Description:Radioligand binding assays for human 5-HT2A receptor was conducted using the 5-HT2 agonist [125I]DOI as radioligand. To define nonspecific binding, 1...
In DepthDetails US Patent