BDBM120759 US8703761, 8-1
SMILES O=C(CC1CCCC1)N1CCC[C@H]1C(=O)Nc1cc(-c2ccccc2)c2ccccc2n1
InChI Key InChIKey=AYBISJYFCMVYPD-DEOSSOPVSA-N
Data  1 IC50
  Tab Delimited (TSV)   2D SDfile   Computed 3D by Vconf -m prep SDfile
Find this compound or compounds like it in BindingDB:
Activity Spreadsheet -- Enzyme Inhibition Constant Data from BindingDB
Found 1 hit for monomerid = 120759
TargetDiacylglycerol O-acyltransferase 1 [89-488](Homo sapiens (Human))
Novartis
US Patent
LigandPNGBDBM120759(US8703761, 8-1)
Affinity DataIC50:  54.5nMpH: 7.5 T: 2°C. Assay description: The enzyme preparation used in this assay is a membrane preparation from Sf9 cells overexpressing human (His)6DGAT1. During all steps samples were ch...
Ligand InfoPC cidPC sid
In DepthDetails US Patent