BDBM12280 3-[[[(1R,5S)-3-[(S)-cyclohexyl[[(1,1-dimethylethoxy)carbonyl]amino]acetyl]-6,6-dimethyl-3-azabicyclo[3.1.0]hexan-2(S)-yl]carbonyl]amino]-2-oxohexanoic acid::3-{[(1R,2S,5S)-3-[(2S)-2-{[(tert-butoxy)carbonyl]amino}-2-cyclohexylacetyl]-6,6-dimethyl-3-azabicyclo[3.1.0]hexan-2-yl]formamido}-2-oxohexanoic acid::SCH 503034 Analogue 39
SMILES CCCC(NC(=O)[C@@H]1[C@@H]2[C@H](CN1C(=O)[C@@H](NC(=O)OC(C)(C)C)C1CCCCC1)C2(C)C)C(=O)C(O)=O
InChI Key InChIKey=HLTUASWYEKUYEG-CRJJDSQLSA-N
Data  1 KI
  Tab Delimited (TSV)   2D SDfile   Computed 3D by Vconf -m prep SDfile
Find this compound or compounds like it in BindingDB:
Activity Spreadsheet -- Enzyme Inhibition Constant Data from BindingDB
Found 1 hit for monomerid = 12280
TargetGenome polyprotein(Hepatitis C virus (HCV genotype 1a, isolate H))
Schering-Plough Research Institute
LigandPNGBDBM12280(3-[[[(1R,5S)-3-[(S)-cyclohexyl[[(1,1-dimethylethox...)
Affinity DataKi:  110nM. Assay description: Proteolytic cleavage of the ester linkage between the Nva (L-norvaline) and the chromophore (PAP) was monitored for change in absorbance at 370 nm. I...
In DepthDetails ArticlePubMed