BDBM12291 1,1-Dimethylethyl-[2-[(1R,5S)-2(S)-[[[3-amino-1-(2-oxetanylmethyl)-2,3-dioxopropyl]amino]carbonyl]-6,6-dimethyl-3-azabicyclo[3.1.0]hexan-3-yl]-1(S)-cyclohexyl-2-oxoethyl]carbamates::SCH 503034 Analogue 50::tert-butyl N-[(1S)-2-[(1R,2S,5S)-2-{[1-carbamoyl-3-(oxetan-2-yl)-1-oxopropan-2-yl]carbamoyl}-6,6-dimethyl-3-azabicyclo[3.1.0]hexan-3-yl]-1-cyclohexyl-2-oxoethyl]carbamate
SMILES CC(C)(C)OC(=O)N[C@@H](C1CCCCC1)C(=O)N1C[C@H]2[C@@H]([C@H]1C(=O)NC(CC1CCO1)C(=O)C(N)=O)C2(C)C
InChI Key InChIKey=YUBSAVJQKHPCPP-FVNXWLSPSA-N
Data  1 KI
  Tab Delimited (TSV)   2D SDfile   Computed 3D by Vconf -m prep SDfile
Find this compound or compounds like it in BindingDB:
Activity Spreadsheet -- Enzyme Inhibition Constant Data from BindingDB
Found 1 hit for monomerid = 12291
TargetGenome polyprotein(Hepatitis C virus (HCV genotype 1a, isolate H))
Schering-Plough Research Institute
LigandPNGBDBM12291(1,1-Dimethylethyl-[2-[(1R,5S)-2(S)-[[[3-amino-1-(2...)
Affinity DataKi:  90nM. Assay description: Proteolytic cleavage of the ester linkage between the Nva (L-norvaline) and the chromophore (PAP) was monitored for change in absorbance at 370 nm. I...
In DepthDetails ArticlePubMed