BDBM128128 (8R)-3-[3-[[(2R)-5-oxidanylidenepyrrolidin-2-yl]carbonylamino]phenyl]-7-(phenylcarbonyl)-1-oxa-2,7-diazaspiro[4.4]non-2-ene-8-carboxamide::(8R)-7-benzoyl-3-[3-[[(2R)-5-ketoprolyl]amino]phenyl]-1-oxa-2,7-diazaspiro[4.4]non-2-ene-8-carboxamide::(8R)-7-benzoyl-3-[3-[[(2R)-5-oxopyrrolidine-2-carbonyl]amino]phenyl]-1-oxa-2,7-diazaspiro[4.4]non-2-ene-8-carboxamide::(8R)-7-benzoyl-3-[3-[[oxo-[(2R)-5-oxo-2-pyrrolidinyl]methyl]amino]phenyl]-1-oxa-2,7-diazaspiro[4.4]non-2-ene-8-carboxamide::MLS000562025::SMR000390578::cid_16681949
SMILES NC(=O)[C@H]1CC2(CN1C(=O)c1ccccc1)CC(=NO2)c1cccc(NC(=O)[C@H]2CCC(=O)N2)c1
InChI Key InChIKey=RZQYWJQMZSMMRK-DUTPZCPISA-N
Data  1 IC50
  Tab Delimited (TSV)   2D SDfile   Computed 3D by Vconf -m prep SDfile
Find this compound or compounds like it in BindingDB:
Activity Spreadsheet -- Enzyme Inhibition Constant Data from BindingDB
Found 1 hit for monomerid = 128128
TargetRNA-editing ligase 1, mitochondrial(Trypanosoma brucei brucei)
The Scripps Research Institute Molecular Screening Center
Curated by PubChem BioAssay
LigandPNGBDBM128128((8R)-3-[3-[[(2R)-5-oxidanylidenepyrrolidin-2-yl]ca...)
Affinity DataIC50:  1.97E+4nM. Assay description: Source (MLPCN Center Name): The Scripps Research Institute Molecular Screening Center (SRIMSC) Center Affiliation: The Scripps Research Institute Ass...
In DepthDetails PCBioAssay