BDBM128137 (6-methoxy-2-methyl-4-quinolyl)-[3-(trifluoromethyl)benzyl]amine::6-methoxy-2-methyl-N-[[3-(trifluoromethyl)phenyl]methyl]-4-quinolinamine::6-methoxy-2-methyl-N-[[3-(trifluoromethyl)phenyl]methyl]quinolin-4-amine::MLS001174340::SMR000589989::cid_4841980
SMILES COc1ccc2nc(C)cc(NCc3cccc(c3)C(F)(F)F)c2c1
InChI Key InChIKey=SGDQPSJNELHSAJ-UHFFFAOYSA-N
Data  1 IC50
  Tab Delimited (TSV)   2D SDfile   Computed 3D by Vconf -m prep SDfile
Find this compound or compounds like it in BindingDB:
Activity Spreadsheet -- Enzyme Inhibition Constant Data from BindingDB
Found 1 hit for monomerid = 128137
TargetRNA-editing ligase 1, mitochondrial(Trypanosoma brucei brucei)
The Scripps Research Institute Molecular Screening Center
Curated by PubChem BioAssay
LigandPNGBDBM128137((6-methoxy-2-methyl-4-quinolyl)-[3-(trifluoromethy...)
Affinity DataIC50: >9.66E+4nM. Assay description: Source (MLPCN Center Name): The Scripps Research Institute Molecular Screening Center (SRIMSC) Center Affiliation: The Scripps Research Institute Ass...
In DepthDetails PCBioAssay