BDBM128175 4-(3-fluorophenyl)-6-methyl-1-[3-(trifluoromethyl)benzyl]-2-[[2-(trifluoromethyl)benzyl]amino]-4H-pyrimidine-5-carboxylic acid methyl ester::4-(3-fluorophenyl)-6-methyl-1-[[3-(trifluoromethyl)phenyl]methyl]-2-[[2-(trifluoromethyl)phenyl]methylamino]-4H-pyrimidine-5-carboxylic acid methyl ester::MLS003843167::SMR002515880::cid_53316267::methyl 4-(3-fluorophenyl)-6-methyl-1-[[3-(trifluoromethyl)phenyl]methyl]-2-[[2-(trifluoromethyl)phenyl]methylamino]-4H-pyrimidine-5-carboxylate
SMILES COC(=O)C1=C(C)N(Cc2cccc(c2)C(F)(F)F)C(NCc2ccccc2C(F)(F)F)=NC1c1cccc(F)c1
InChI Key InChIKey=YCCMIUMLDZCTHA-UHFFFAOYSA-N
Data  1 IC50
  Tab Delimited (TSV)   2D SDfile   Computed 3D by Vconf -m prep SDfile
Find this compound or compounds like it in BindingDB:
Activity Spreadsheet -- Enzyme Inhibition Constant Data from BindingDB
Found 1 hit for monomerid = 128175
TargetRNA-editing ligase 1, mitochondrial(Trypanosoma brucei brucei)
The Scripps Research Institute Molecular Screening Center
Curated by PubChem BioAssay
LigandPNGBDBM128175(4-(3-fluorophenyl)-6-methyl-1-[3-(trifluoromethyl)...)
Affinity DataIC50: >9.66E+4nM. Assay description: Source (MLPCN Center Name): The Scripps Research Institute Molecular Screening Center (SRIMSC) Center Affiliation: The Scripps Research Institute Ass...
In DepthDetails PCBioAssay