BDBM128180 2-(1,3-benzodioxol-5-ylmethylamino)-6-methyl-4-phenyl-1-[[2-(trifluoromethyl)phenyl]methyl]-4H-pyrimidine-5-carboxylic acid methyl ester::6-methyl-4-phenyl-2-(piperonylamino)-1-[2-(trifluoromethyl)benzyl]-4H-pyrimidine-5-carboxylic acid methyl ester::MLS003843351::SMR002516064::cid_53316159::methyl 2-(1,3-benzodioxol-5-ylmethylamino)-6-methyl-4-phenyl-1-[[2-(trifluoromethyl)phenyl]methyl]-4H-pyrimidine-5-carboxylate
SMILES COC(=O)C1=C(C)N(Cc2ccccc2C(F)(F)F)C(NCc2ccc3OCOc3c2)=NC1c1ccccc1
InChI Key InChIKey=DOLQEXKLZJXWAP-UHFFFAOYSA-N
Data  1 IC50
  Tab Delimited (TSV)   2D SDfile   Computed 3D by Vconf -m prep SDfile
Find this compound or compounds like it in BindingDB:
Activity Spreadsheet -- Enzyme Inhibition Constant Data from BindingDB
Found 1 hit for monomerid = 128180
TargetRNA-editing ligase 1, mitochondrial(Trypanosoma brucei brucei)
The Scripps Research Institute Molecular Screening Center
Curated by PubChem BioAssay
LigandPNGBDBM128180(2-(1,3-benzodioxol-5-ylmethylamino)-6-methyl-4-phe...)
Affinity DataIC50: >9.66E+4nM. Assay description: Source (MLPCN Center Name): The Scripps Research Institute Molecular Screening Center (SRIMSC) Center Affiliation: The Scripps Research Institute Ass...
In DepthDetails PCBioAssay