BDBM128196 2-(benzylamino)-6-methyl-4-phenethyl-1-[2-(trifluoromethyl)benzyl]-4H-pyrimidine-5-carboxylic acid methyl ester::6-methyl-4-(2-phenylethyl)-2-[(phenylmethyl)amino]-1-[[2-(trifluoromethyl)phenyl]methyl]-4H-pyrimidine-5-carboxylic acid methyl ester::MLS003843398::SMR002516111::cid_53316221::methyl 2-(benzylamino)-6-methyl-4-(2-phenylethyl)-1-[[2-(trifluoromethyl)phenyl]methyl]-4H-pyrimidine-5-carboxylate::methyl 6-methyl-4-(2-phenylethyl)-2-[(phenylmethyl)amino]-1-[[2-(trifluoromethyl)phenyl]methyl]-4H-pyrimidine-5-carboxylate
SMILES COC(=O)C1=C(C)N(Cc2ccccc2C(F)(F)F)C(NCc2ccccc2)=NC1CCc1ccccc1
InChI Key InChIKey=WURDPAAKPUIYKI-UHFFFAOYSA-N
Data  1 IC50
  Tab Delimited (TSV)   2D SDfile   Computed 3D by Vconf -m prep SDfile
Find this compound or compounds like it in BindingDB:
Activity Spreadsheet -- Enzyme Inhibition Constant Data from BindingDB
Found 1 hit for monomerid = 128196
TargetRNA-editing ligase 1, mitochondrial(Trypanosoma brucei brucei)
The Scripps Research Institute Molecular Screening Center
Curated by PubChem BioAssay
LigandPNGBDBM128196(2-(benzylamino)-6-methyl-4-phenethyl-1-[2-(trifluo...)
Affinity DataIC50: >9.66E+4nM. Assay description: Source (MLPCN Center Name): The Scripps Research Institute Molecular Screening Center (SRIMSC) Center Affiliation: The Scripps Research Institute Ass...
In DepthDetails PCBioAssay