BDBM128223 (4-bromanyl-2-methyl-pyrazol-3-yl)-(2,3-dihydroindol-1-yl)methanone::(4-bromo-2-methyl-3-pyrazolyl)-(2,3-dihydroindol-1-yl)methanone::(4-bromo-2-methyl-pyrazol-3-yl)-indolin-1-yl-methanone::(4-bromo-2-methylpyrazol-3-yl)-(2,3-dihydroindol-1-yl)methanone::1-[(4-bromo-1-methyl-1H-pyrazol-5-yl)carbonyl]indoline::MLS000704145::SMR000227173::cid_903067
SMILES Cn1ncc(Br)c1C(=O)N1CCc2ccccc12
InChI Key InChIKey=IHCMZNYXIASBGZ-UHFFFAOYSA-N
Data  1 IC50  1 EC50
  Tab Delimited (TSV)   2D SDfile   Computed 3D by Vconf -m prep SDfile
Find this compound or compounds like it in BindingDB:
Activity Spreadsheet -- Enzyme Inhibition Constant Data from BindingDB
Found 2 hits for monomerid = 128223
TargetTransthyretin(Homo sapiens (Human))
The Scripps Research Institute Molecular Screening Center
Curated by PubChem BioAssay
LigandPNGBDBM128223((4-bromanyl-2-methyl-pyrazol-3-yl)-(2,3-dihydroind...)
Affinity DataEC50: >1.67E+5nM. Assay description: Source (MLPCN Center Name): The Scripps Research Institute Molecular Screening Center (SRIMSC) Affiliation: The Scripps Research Institute, TSRI Assa...
In DepthDetails PCBioAssay
TargetTransthyretin(Homo sapiens (Human))
The Scripps Research Institute Molecular Screening Center
Curated by PubChem BioAssay
LigandPNGBDBM128223((4-bromanyl-2-methyl-pyrazol-3-yl)-(2,3-dihydroind...)
Affinity DataIC50: >1.67E+5nM. Assay description: Source (MLPCN Center Name): The Scripps Research Institute Molecular Screening Center (SRIMSC) Affiliation: The Scripps Research Institute, TSRI Assa...
In DepthDetails PCBioAssay