BDBM128235 2,5-bis[(dimethylamino)methyl]-1,1,6,6-tetraphenyl-hexane-1,6-diol::2,5-bis[(dimethylamino)methyl]-1,1,6,6-tetraphenylhexane-1,6-diol::MLS001173677::SMR000538747::cid_3781244
SMILES CN(C)CC(CCC(CN(C)C)C(O)(c1ccccc1)c1ccccc1)C(O)(c1ccccc1)c1ccccc1
InChI Key InChIKey=KFEZGJFTVICLIJ-UHFFFAOYSA-N
Data  1 IC50  1 EC50
  Tab Delimited (TSV)   2D SDfile   Computed 3D by Vconf -m prep SDfile
Find this compound or compounds like it in BindingDB:
Activity Spreadsheet -- Enzyme Inhibition Constant Data from BindingDB
Found 2 hits for monomerid = 128235
TargetTransthyretin(Homo sapiens (Human))
The Scripps Research Institute Molecular Screening Center
Curated by PubChem BioAssay
LigandPNGBDBM128235(2,5-bis[(dimethylamino)methyl]-1,1,6,6-tetraphenyl...)
Affinity DataEC50: >1.67E+5nM. Assay description: Source (MLPCN Center Name): The Scripps Research Institute Molecular Screening Center (SRIMSC) Affiliation: The Scripps Research Institute, TSRI Assa...
In DepthDetails PCBioAssay
TargetTransthyretin(Homo sapiens (Human))
The Scripps Research Institute Molecular Screening Center
Curated by PubChem BioAssay
LigandPNGBDBM128235(2,5-bis[(dimethylamino)methyl]-1,1,6,6-tetraphenyl...)
Affinity DataIC50:  1.72E+4nM. Assay description: Source (MLPCN Center Name): The Scripps Research Institute Molecular Screening Center (SRIMSC) Affiliation: The Scripps Research Institute, TSRI Assa...
In DepthDetails PCBioAssay