BDBM132071 US8841453, 1
SMILES CC(=O)NCCc1c[nH]c2ccc(OC(=O)NCCCCCCCNc3c4CCCCc4nc4ccccc34)cc12
InChI Key InChIKey=AKQSCHLJARNVMJ-UHFFFAOYSA-N
Data  2 IC50
  Tab Delimited (TSV)   2D SDfile   Computed 3D by Vconf -m prep SDfile
Find this compound or compounds like it in BindingDB:
Activity Spreadsheet -- Enzyme Inhibition Constant Data from BindingDB
Found 2 hits for monomerid = 132071
TargetCholinesterase(Homo sapiens (Human))
Uniwersytet Warszawski
US Patent
LigandPNGBDBM132071(US8841453, 1)
Affinity DataIC50:  0.25nM. Assay description: The biological activity of the compounds of general formula (I) towards the cholinesterase inhibition was evaluated using Ellman's method (Ellman, G....
In DepthDetails US Patent
TargetAcetylcholinesterase(Homo sapiens (Human))
Uniwersytet Warszawski
US Patent
LigandPNGBDBM132071(US8841453, 1)
Affinity DataIC50:  33.8nM. Assay description: The biological activity of the compounds of general formula (I) towards the cholinesterase inhibition was evaluated using Ellman's method (Ellman, G....
In DepthDetails US Patent