BDBM13867 3-amidinobenzylindole carboxamide 51::N,1-bis[(3-carbamimidoylphenyl)methyl]-5-hydroxy-1H-indole-2-carboxamide
SMILES NC(=N)c1cccc(CNC(=O)c2cc3cc(O)ccc3n2Cc2cccc(c2)C(N)=N)c1
InChI Key InChIKey=WQMLURUPDYUIKJ-UHFFFAOYSA-N
Data  1 KI
  Tab Delimited (TSV)   2D SDfile   Computed 3D by Vconf -m prep SDfile
Find this compound or compounds like it in BindingDB:
Activity Spreadsheet -- Enzyme Inhibition Constant Data from BindingDB
Found 1 hit for monomerid = 13867
TargetCoagulation factor X(Homo sapiens (Human))
Aventis Pharma Deutschland
LigandPNGBDBM13867(3-amidinobenzylindole carboxamide 51 | N,1-bis[(3-...)
Affinity DataKi:  77nM. Assay description: The inhibitory effect of test compound for human fXa was determined by using the chromogenic substrates S-2765. The hydrolysis rates of chromogenic s...
In DepthDetails ArticlePubMed