BDBM13893 2,2,2-trifluoroacetate; 4-[({1-[(3-carbamimidoylphenyl)methyl]-4-methoxy-1H-indol-2-yl}formamido)methyl]-N,N,N-trimethylanilinium::3-amidinobenzylindole carboxamide 78
SMILES COc1cccc2n(Cc3cccc(c3)C(N)=N)c(cc12)C(=O)NCc1ccc(cc1)[N+](C)(C)C
InChI Key InChIKey=DDDMCGGVAQNMNT-UHFFFAOYSA-O
Data  1 KI
  Tab Delimited (TSV)   2D SDfile   Computed 3D by Vconf -m prep SDfile
Find this compound or compounds like it in BindingDB:
Activity Spreadsheet -- Enzyme Inhibition Constant Data from BindingDB
Found 1 hit for monomerid = 13893
TargetCoagulation factor X(Homo sapiens (Human))
Aventis Pharma Deutschland
LigandPNGBDBM13893(2,2,2-trifluoroacetate; 4-[({1-[(3-carbamimidoylph...)
Affinity DataKi:  62nM. Assay description: The inhibitory effect of test compound for human fXa was determined by using the chromogenic substrates S-2765. The hydrolysis rates of chromogenic s...
In DepthDetails ArticlePubMed