BDBM139197 US8889668, I25
SMILES COc1ccccc1-c1noc(n1)-c1ccc(-c2cscc2C)c(C)c1
InChI Key InChIKey=RBSCPVUHCHQDCH-UHFFFAOYSA-N
Data  1 KI
  Tab Delimited (TSV)   2D SDfile   Computed 3D by Vconf -m prep SDfile
Find this compound or compounds like it in BindingDB:
Activity Spreadsheet -- Enzyme Inhibition Constant Data from BindingDB
Found 1 hit for monomerid = 139197
TargetSphingosine 1-phosphate receptor 1(Homo sapiens (Human))
Merck Serono
US Patent
LigandPNGBDBM139197(US8889668, I25)
Affinity DataKi:  3nM ΔG°:  -10.8kcal/molepH: 7.4 T: 2°C. Assay description: Receptor binding assay: Membranes were prepared from CHO cells expressing S1P1 or S1P3 for use in ligand and 35S-GTPgammaS binding studies. Cells wer...
In DepthDetails US Patent