BDBM142770 US8940719, 19
SMILES C[C@H](CCCn1cc(CC(N)C(O)=O)nn1)C1CC[C@H]2C3CC[C@@H]4C[C@H](O)CC[C@]4(C)C3CC[C@]12C
InChI Key InChIKey=XAIDRUKXXQDPQU-PNKDBZHZSA-N
Data  1 IC50
  Tab Delimited (TSV)   2D SDfile   Computed 3D by Vconf -m prep SDfile
Find this compound or compounds like it in BindingDB:
Activity Spreadsheet -- Enzyme Inhibition Constant Data from BindingDB
Found 1 hit for monomerid = 142770
TargetCMP-N-acetylneuraminate-beta-galactosamide-alpha-2,3-sialyltransferase 2(Rattus norvegicus (Rat))
Academia Sinica
US Patent
LigandPNGBDBM142770(US8940719, 19)
Affinity DataIC50:  8.30E+4nM. Assay description: Enzyme activity was determined by monitoring the quantity of sialylated disaccharide product produced over time at 348 nm by RP-HPLC (Supelco Discove...
In DepthDetails US Patent