BDBM144813 US8952150, 118
SMILES Oc1ccc(Nc2nc(NCCOCCNC(=O)c3ccccc3)nc(Nc3ccc(cc3)C(=O)NCc3ccccc3)n2)cc1
InChI Key InChIKey=ZEPIQVOCAFUEQH-UHFFFAOYSA-N
Data  1 IC50
  Tab Delimited (TSV)   2D SDfile   Computed 3D by Vconf -m prep SDfile
Find this compound or compounds like it in BindingDB:
Activity Spreadsheet -- Enzyme Inhibition Constant Data from BindingDB
Found 1 hit for monomerid = 144813
TargetSolute carrier organic anion transporter family member 2A1(Rattus norvegicus (Rat))
Albert Einstein College Of Medicine Of Yeshiva University
US Patent
LigandPNGBDBM144813(US8952150, 118)
Affinity DataIC50:  20.9nMT: 2°C. Assay description: MDCK cells stably transfected with rat PGT (Endo et al., 2002) were seeded at 15-20% confluence on 24-well plates. The day on which the cells were se...
In DepthDetails US Patent