BDBM14780 Pyrazole carboxylic ester 3::ethyl 3-methyl-1H-pyrazole-4-carboxylate
SMILES CCOC(=O)c1cn[nH]c1C
InChI Key InChIKey=HHYVTIKYZUMDIL-UHFFFAOYSA-N
Data  2 IC50
  Tab Delimited (TSV)   2D SDfile   Computed 3D by Vconf -m prep SDfile
Find this compound or compounds like it in BindingDB:
Activity Spreadsheet -- Enzyme Inhibition Constant Data from BindingDB
Found 2 hits for monomerid = 14780
LigandPNGBDBM14780(Pyrazole carboxylic ester 3 | ethyl 3-methyl-1H-py...)
Affinity DataIC50: >2.00E+5nM. Assay description: Phosphodiesterase activities were assayed in the presence of inhibitor compounds. Measurement takes advantage of the selective binding of 5-AMP or 5-...
In DepthDetails ArticlePubMed
LigandPNGBDBM14780(Pyrazole carboxylic ester 3 | ethyl 3-methyl-1H-py...)
Affinity DataIC50: >2.00E+5nMpH: 7.5 T: 2°C. Assay description: Phosphodiesterase activities were assayed in the presence of inhibitor compounds. Measurement takes advantage of the selective binding of 5-AMP or 5-...
In DepthDetails ArticlePubMed