BDBM150239 US8980929, Example Compound 7
SMILES Cc1c2CN(Cc2nn1S(=O)(=O)C1(C)CC1)[C@H]1CCO[C@@H]([C@@H](N)C1)c1cc(F)ccc1F
InChI Key InChIKey=CBZBBEYWAOHFSD-PAXLWEDBSA-N
Data  1 IC50
  Tab Delimited (TSV)   2D SDfile   Computed 3D by Vconf -m prep SDfile
Find this compound or compounds like it in BindingDB:
Activity Spreadsheet -- Enzyme Inhibition Constant Data from BindingDB
Found 1 hit for monomerid = 150239
TargetDipeptidyl peptidase 4(Homo sapiens (Human))
Merck Sharp & Dohme
US Patent
LigandPNGBDBM150239(US8980929, Example Compound 7)
Affinity DataIC50:  0.5nMpH: 7.5Assay Description:A continuous fluorometric assay is employed with the substrate Gly-Pro-AMC, which is cleaved by DPP-4 to release the fluorescent AMC leaving group. T...
In DepthDetails US Patent