BDBM150245 US8980929, Example Compound 13
SMILES CC1(CC1)S(=O)(=O)n1cc2CN(Cc2n1)[C@H]1CCO[C@@H]([C@@H](N)C1)c1cc(F)ccc1F
InChI Key InChIKey=OYGXGJMMFOYYGA-ZAAXVRCTSA-N
Data  1 IC50
  Tab Delimited (TSV)   2D SDfile   Computed 3D by Vconf -m prep SDfile
Find this compound or compounds like it in BindingDB:
Activity Spreadsheet -- Enzyme Inhibition Constant Data from BindingDB
Found 1 hit for monomerid = 150245
TargetDipeptidyl peptidase 4(Homo sapiens (Human))
Merck Sharp & Dohme
US Patent
LigandPNGBDBM150245(US8980929, Example Compound 13)
Affinity DataIC50:  8.10nMpH: 7.5Assay Description:A continuous fluorometric assay is employed with the substrate Gly-Pro-AMC, which is cleaved by DPP-4 to release the fluorescent AMC leaving group. T...
In DepthDetails US Patent