BDBM152814 US8993575, 4
SMILES OCc1ccc(cc1)-c1nnc(SCCCN2CCC(CC2)c2noc3cc(F)ccc23)o1
InChI Key InChIKey=WLENIHIIUXPWCA-UHFFFAOYSA-N
Data  2 IC50
  Tab Delimited (TSV)   2D SDfile   Computed 3D by Vconf -m prep SDfile
Find this compound or compounds like it in BindingDB:
Activity Spreadsheet -- Enzyme Inhibition Constant Data from BindingDB
Found 2 hits for monomerid = 152814
Target5-hydroxytryptamine receptor 2A(Rattus norvegicus (rat))
Huazhong University Of Science & Technology
US Patent
LigandPNGBDBM152814(US8993575, 4)
Affinity DataIC50:  0.510nMpH: 7.5Assay Description:Materials for the Receptor Binding AssayIsotope ligand [3H]-Ketanserin (67.0 Ci/mmol) was purchased from PerkinElmer Company; Methysergide was purcha...
In DepthDetails US Patent
Target5-hydroxytryptamine receptor 1A(Rattus norvegicus (rat))
Huazhong University Of Science & Technology
US Patent
LigandPNGBDBM152814(US8993575, 4)
Affinity DataIC50:  12.7nM. Assay description: Isotope ligand 3H-8-OH-DPAT (67.0 Ci/mmol) was purchased from PerkinElmer Company; 5-HT was purchased from RBI Company; GF/C glass fiber filter paper...
In DepthDetails US Patent