BDBM153218 US8993756, 15-2
SMILES CCOC(=O)c1c[nH]c2ncnc(-c3cccc(NC(=O)C(=C)CO)c3)c12
InChI Key InChIKey=OOKHLJVVFRLORH-UHFFFAOYSA-N
Data  2 IC50
  Tab Delimited (TSV)   2D SDfile   Computed 3D by Vconf -m prep SDfile
Find this compound or compounds like it in BindingDB:
Activity Spreadsheet -- Enzyme Inhibition Constant Data from BindingDB
Found 2 hits for monomerid = 153218
TargetTyrosine-protein kinase JAK2(Homo sapiens (Human))
Merck Sharp & Dohme
US Patent
LigandPNGBDBM153218(US8993756, 15-2)
Affinity DataIC50: >1.50E+3nMT: 2°C. Assay description: The ability of compounds to inhibit the activity of JAKl, JAK2, JAK3, and Tyk2 was measured using a recombinant purified GST-tagged catalytic domain ...
In DepthDetails US Patent
TargetTyrosine-protein kinase JAK3(Homo sapiens (Human))
Merck Sharp & Dohme
US Patent
LigandPNGBDBM153218(US8993756, 15-2)
Affinity DataIC50:  0.0200nMT: 2°C. Assay description: The ability of compounds to inhibit the activity of JAKl, JAK2, JAK3, and Tyk2 was measured using a recombinant purified GST-tagged catalytic domain ...
In DepthDetails US Patent