BDBM159657 US9035059, 7-76
SMILES Cc1ccc(cc1)-n1cc(CN2CCc3cc(ccc3C2)S(=O)(=O)Nc2ccc(CCCC3CCCC3)cc2F)cn1
InChI Key InChIKey=FDRFPNPWLWDWTN-UHFFFAOYSA-N
Data  1 IC50
  Tab Delimited (TSV)   2D SDfile   Computed 3D by Vconf -m prep SDfile
Find this compound or compounds like it in BindingDB:
Activity Spreadsheet -- Enzyme Inhibition Constant Data from BindingDB
Found 1 hit for monomerid = 159657
Target2-acylglycerol O-acyltransferase 2(Homo sapiens (Human))
Taisho Pharmaceutical
US Patent
LigandPNGBDBM159657(US9035059, 7-76)
Affinity DataIC50:  16nMT: 2°C. Assay description: An MGAT2 inhibition test for test compounds was conducted in accordance with a partially modified version of the method described in John F. Lockwood...
In DepthDetails US Patent