BDBM159704 US9035059, 18-6
SMILES CCCCCCOc1ccc(NS(=O)(=O)c2ccc3CN(Cc3c2)C(=O)Nc2ccc(cc2)C(C)(C)C)c(F)c1
InChI Key InChIKey=MLZQWQQHGHTNJC-UHFFFAOYSA-N
Data  1 IC50
  Tab Delimited (TSV)   2D SDfile   Computed 3D by Vconf -m prep SDfile
Find this compound or compounds like it in BindingDB:
Activity Spreadsheet -- Enzyme Inhibition Constant Data from BindingDB
Found 1 hit for monomerid = 159704
Target2-acylglycerol O-acyltransferase 2(Homo sapiens (Human))
Taisho Pharmaceutical
US Patent
LigandPNGBDBM159704(US9035059, 18-6)
Affinity DataIC50:  43nM. Assay description: A test for MGAT2 inhibitory action of test compounds was conducted in accordance with a partially modified version of the method described in John F....
In DepthDetails US Patent