BDBM16070 (2R,4S)-4-[(3R,6S,9R)-9-(acetylamino)-6-methyl-5,8-dioxo-1,11-dithia-4,7-diazacyclopentadecan-3-yl]-N-butyl-4-hydroxy-2-methylbutanamide::(2R,4S)-N-butyl-4-[(3R,6S,9R)-9-acetamido-6-methyl-5,8-dioxo-1,11-dithia-4,7-diazacyclopentadecan-3-yl]-4-hydroxy-2-methylbutanamide::dithia macrocycle compound 29
SMILES CCCCNC(=O)[C@H](C)C[C@H](O)[C@@H]1CSCCCCSC[C@H](NC(C)=O)C(=O)N[C@@H](C)C(=O)N1
InChI Key InChIKey=YVEYBTMFDSNOKH-JVJLKXRTSA-N
Data  2 IC50
  Tab Delimited (TSV)   2D SDfile   Computed 3D by Vconf -m prep SDfile
Find this compound or compounds like it in BindingDB:
Activity Spreadsheet -- Enzyme Inhibition Constant Data from BindingDB
Found 2 hits for monomerid = 16070
TargetCathepsin D(Homo sapiens (Human))
Universite De Montreal At Succursale Centre-Ville
LigandPNGBDBM16070((2R,4S)-4-[(3R,6S,9R)-9-(acetylamino)-6-methyl-5,8...)
Affinity DataIC50:  9.70E+3nMT: 2°C. Assay description: Inhibition assays were done in black 96-well plates by adding test compounds to the respective enzyme in assay buffer. Plates were incubated at room ...
In DepthDetails ArticlePubMed
TargetBeta-secretase 1 [1-453](Homo sapiens (Human))
Universite De Montreal At Succursale Centre-Ville
LigandPNGBDBM16070((2R,4S)-4-[(3R,6S,9R)-9-(acetylamino)-6-methyl-5,8...)
Affinity DataIC50: >1.00E+4nMpH: 4.5 T: 2°C. Assay description: Inhibition assays were done in black 96-well plates by adding test compounds to the respective enzyme in assay buffer. Plates were incubated at room ...
In DepthDetails ArticlePubMed