BDBM161448 US10124003, Ex. Compound 61::US10835536, Ex. Comp 61::US9108973, 61
SMILES COc1cc(OC)cc(c1)C#Cc1cn(C2CN(C2)C(=O)\C=C\CN2CCC(O)CC2)c2ncnc(N)c12
InChI Key InChIKey=KLJNJQGYEHAOQH-ONEGZZNKSA-N
Data  3 IC50
  Tab Delimited (TSV)   2D SDfile   Computed 3D by Vconf -m prep SDfile
Find this compound or compounds like it in BindingDB:
Activity Spreadsheet -- Enzyme Inhibition Constant Data from BindingDB
Found 3 hits for monomerid = 161448
TargetFibroblast growth factor receptor 2(Homo sapiens (Human))
Taiho Pharmaceutical
US Patent
LigandPNGBDBM161448(US10124003, Ex. Compound 61 | US10835536, Ex. Comp...)
Affinity DataIC50:  2.30nMpH: 7.5 T: 2°C. Assay description: When setting conditions for the measurement of the inhibitory effect of the compounds on FGFR2 kinase activity, FL-Peptide 22 (Caliper Life Sciences,...
In DepthDetails US Patent
TargetFibroblast growth factor receptor 2(Homo sapiens (Human))
Taiho Pharmaceutical
US Patent
LigandPNGBDBM161448(US10124003, Ex. Compound 61 | US10835536, Ex. Comp...)
Affinity DataIC50:  2.30nM. Assay description: When setting conditions for the measurement of the inhibitory effect of the compounds on FGFR2 kinase activity, FL-Peptide 22 (Caliper Life Sciences,...
In DepthDetails US Patent
TargetFibroblast growth factor receptor 2(Homo sapiens (Human))
Taiho Pharmaceutical
US Patent
LigandPNGBDBM161448(US10124003, Ex. Compound 61 | US10835536, Ex. Comp...)
Affinity DataIC50:  2.30nM. Assay description: When setting conditions for the measurement of the inhibitory effect of the compounds on FGFR2 kinase activity, FL-Peptide 22 (Caliper Life Sciences,...
In DepthDetails US Patent