BDBM161466 US10124003, Ref. Ex. Compound 7::US10835536, Ref. Ex. Comp 7::US10894048, Ref. Ex Comp. 7::US9108973, Ref 7
SMILES CN(C)C\C=C\C(=O)N1CC[C@@H](C1)n1nc(C#Cc2cccnc2)c2c(N)ncnc12
InChI Key InChIKey=RSKJKOCCSDYJNM-YXMMZVCTSA-N
Data  4 IC50
  Tab Delimited (TSV)   2D SDfile   Computed 3D by Vconf -m prep SDfile
Find this compound or compounds like it in BindingDB:
Activity Spreadsheet -- Enzyme Inhibition Constant Data from BindingDB
Found 4 hits for monomerid = 161466
TargetFibroblast growth factor receptor 2(Homo sapiens (Human))
Taiho Pharmaceutical
US Patent
LigandPNGBDBM161466(US10124003, Ref. Ex. Compound 7 | US10835536, Ref....)
Affinity DataIC50:  1.60E+3nMpH: 7.5 T: 2°C. Assay description: When setting conditions for the measurement of the inhibitory effect of the compounds on FGFR2 kinase activity, FL-Peptide 22 (Caliper Life Sciences,...
In DepthDetails US Patent
TargetFibroblast growth factor receptor 2(Homo sapiens (Human))
Taiho Pharmaceutical
US Patent
LigandPNGBDBM161466(US10124003, Ref. Ex. Compound 7 | US10835536, Ref....)
Affinity DataIC50:  1.60E+3nM. Assay description: When setting conditions for the measurement of the inhibitory effect of the compounds on FGFR2 kinase activity, FL-Peptide 22 (Caliper Life Sciences,...
In DepthDetails US Patent
TargetFibroblast growth factor receptor 2(Homo sapiens (Human))
Taiho Pharmaceutical
US Patent
LigandPNGBDBM161466(US10124003, Ref. Ex. Compound 7 | US10835536, Ref....)
Affinity DataIC50:  1.60E+3nM. Assay description: When setting conditions for the measurement of the inhibitory effect of the compounds on FGFR2 kinase activity, FL-Peptide 22 (Caliper Life Sciences,...
In DepthDetails US Patent
TargetFibroblast growth factor receptor 2(Homo sapiens (Human))
Taiho Pharmaceutical
US Patent
LigandPNGBDBM161466(US10124003, Ref. Ex. Compound 7 | US10835536, Ref....)
Affinity DataIC50:  1.60E+3nM. Assay description: When setting conditions for the measurement of the inhibitory effect of the compounds on FGFR2 kinase activity, FL-Peptide 22 (Caliper Life Sciences,...
In DepthDetails US Patent