BDBM16260 1-N-[(1R,3S,4S)-3-hydroxy-1,6-dimethyl-1-{[(1S)-2-methyl-1-(propan-2-ylcarbamoyl)propyl]carbamoyl}heptan-4-yl]-5-(N-methylmethanesulfonamido)-3-N-[(1S)-1-phenylethyl]benzene-1,3-dicarboxamide::Isophthalamide Derivative 5e
SMILES CC(C)C[C@H](NC(=O)c1cc(cc(c1)C(=O)N[C@@H](C)c1ccccc1)N(C)S(C)(=O)=O)[C@@H](O)C[C@@H](C)C(=O)N[C@@H](C(C)C)C(=O)NC(C)C
InChI Key InChIKey=BJOCXJJVELLFKM-WXRFDULFSA-N
Data  1 KI
  Tab Delimited (TSV)   2D SDfile   Computed 3D by Vconf -m prep SDfile
Find this compound or compounds like it in BindingDB:
Activity Spreadsheet -- Enzyme Inhibition Constant Data from BindingDB
Found 1 hit for monomerid = 16260
TargetBeta-secretase 1(Homo sapiens (Human))
Purdue University
LigandPNGBDBM16260(1-N-[(1R,3S,4S)-3-hydroxy-1,6-dimethyl-1-{[(1S)-2-...)
Affinity DataKi:  315nM ΔG°:  -9.22kcal/molepH: 4.5 T: 2°C. Assay description: Enzyme activities were assayed by monitoring the hydrolysis of substrate in the presence or absence of inhibitor compounds. The hydrolysis was record...
In DepthDetails ArticlePubMed