BDBM16432 1-(carboxymethyl)cyclopenta-2,4-dien-1-ide cyclopentane-1,2,3,4,5-pentaide iron::Ferrocene acetic acid
SMILES OC(=O)C[c-]1cccc1
InChI Key InChIKey=MEOPZDVRDNOGOW-UHFFFAOYSA-N
Data  1 KI
  Tab Delimited (TSV)   2D SDfile   Computed 3D by Vconf -m prep SDfile
Find this compound or compounds like it in BindingDB:
Activity Spreadsheet -- Enzyme Inhibition Constant Data from BindingDB
Found 1 hit for monomerid = 16432
TargetAldo-keto reductase family 1 member B1(Homo sapiens (Human))
Medical College Of Wiscosin
LigandPNGBDBM16432(1-(carboxymethyl)cyclopenta-2,4-dien-1-ide cyclope...)
Affinity DataKi:  3.77E+4nM ΔG°:  -6.03kcal/molepH: 7.0 T: 2°C. Assay description: The production of NADPH from NADP+ and benzyl alcohol and xylitol was monitored by an increase in NADPH fluorescence (ex: 340 nm; em: 460 nm) using a...
In DepthDetails ArticlePubMed