BDBM16438 2-amino-3-{[1-(carboxymethyl)-2,5-dioxopyrrolidin-3-yl]sulfanyl}propanoic acid::Cysteine, N-glycylthiosuccinimide
SMILES NC(CSC1CC(=O)N(CC(O)=O)C1=O)C(O)=O
InChI Key InChIKey=FMPVTVDFAHXWNO-UHFFFAOYSA-N
Data  1 KI
  Tab Delimited (TSV)   2D SDfile   Computed 3D by Vconf -m prep SDfile
Find this compound or compounds like it in BindingDB:
Activity Spreadsheet -- Enzyme Inhibition Constant Data from BindingDB
Found 1 hit for monomerid = 16438
TargetAldo-keto reductase family 1 member B1(Homo sapiens (Human))
Medical College Of Wiscosin
LigandPNGBDBM16438(2-amino-3-{[1-(carboxymethyl)-2,5-dioxopyrrolidin-...)
Affinity DataKi:  1.40E+4nM. Assay description: The production of NADPH from NADP+ and benzyl alcohol and xylitol was monitored by an increase in NADPH fluorescence (ex: 340 nm; em: 460 nm) using a...
In DepthDetails ArticlePubMed