BDBM166650 4-((4-(5-methylthiophene-2-carboxamido)phenyl)amino)-4-oxobutanoic acid (9)
SMILES COC(=O)CCC(=O)Nc1ccc(NC(=O)c2ccc(C)s2)cc1
InChI Key InChIKey=HSKFQUAWWXDHQE-UHFFFAOYSA-N
Data  2 IC50
  Tab Delimited (TSV)   2D SDfile   Computed 3D by Vconf -m prep SDfile
Find this compound or compounds like it in BindingDB:
Activity Spreadsheet -- Enzyme Inhibition Constant Data from BindingDB
Found 2 hits for monomerid = 166650
TargetDNA gyrase subunit B(Staphylococcus aureus)
Birla Institute Of Technology
LigandPNGBDBM166650(4-((4-(5-methylthiophene-2-carboxamido)phenyl)amin...)
Affinity DataIC50:  2.26E+4nMpH: 7.6 T: 2°C. Assay description: Supercoiling assay was performed using the commercially available kit (DNA gyrase supercoiling assay kit: SAS4001) from Inspiralis Pvt.limited, Norwi...
In DepthDetails ArticlePubMed
TargetDNA gyrase subunit B(Staphylococcus aureus)
Birla Institute Of Technology
LigandPNGBDBM166650(4-((4-(5-methylthiophene-2-carboxamido)phenyl)amin...)
Affinity DataIC50:  3.75E+4nMpH: 7.5Assay Description:Initially, equimolar quantities of about 0.5µM each of E. coli gyraseA and S. aureus gyraseB were incubated for a period of 45 min with salmon sperm ...
In DepthDetails ArticlePubMed